CRAN Package Check Results for Package ARUtools

Last updated on 2026-10-15 05:58:34 CEST.

Flavor Version Tinstall Tcheck Ttotal Status Flags
r-devel-linux-x86_64-debian-clang 0.7.3 5.49 200.17 205.66 OK
r-devel-linux-x86_64-debian-gcc 0.7.3 3.71 148.73 152.44 OK
r-devel-linux-x86_64-fedora-clang 0.7.3 147.63 OK
r-devel-linux-x86_64-fedora-gcc 0.7.3 148.81 OK
r-devel-windows-x86_64 0.7.3 8.00 184.00 192.00 ERROR
r-patched-linux-x86_64 0.7.3 5.60 191.48 197.08 OK
r-release-linux-x86_64 0.7.3 4.67 188.37 193.04 OK
r-release-macos-arm64 0.7.3 1.00 55.00 56.00 OK
r-release-macos-x86_64 0.7.3 4.00 233.00 237.00 OK
r-release-windows-x86_64 0.7.3 10.00 231.00 241.00 OK
r-oldrel-macos-arm64 0.7.3 OK
r-oldrel-macos-x86_64 0.7.3 3.00 221.00 224.00 OK
r-oldrel-windows-x86_64 0.7.3 11.00 289.00 300.00 OK

Check Details

Version: 0.7.3
Check: examples
Result: ERROR Running examples in 'ARUtools-Ex.R' failed The error most likely occurred in: > ### Name: calc_selection_weights > ### Title: Calculate Selection Weights > ### Aliases: calc_selection_weights > > ### ** Examples > > s <- clean_site_index(example_sites_clean, + name_date_time = c("date_time_start", "date_time_end") + ) > m <- clean_metadata(project_files = example_files) |> + add_sites(s) |> + calc_sun() Extracting ARU info... Extracting Dates and Times... Joining by columns `date_time_start` and `date_time_end` Error in `dplyr::mutate()`: ℹ In argument: `times = purrr::map2(.data$dates, .data$tz, ~calc_all_ss(.x, tz = .y))`. Caused by error in `purrr::map2()`: ℹ In index: 3. Caused by error in `C_force_tz()`: ! CCTZ: Unrecognized output timezone: "America/Winnipeg" Backtrace: ▆ 1. ├─ARUtools::calc_sun(...) 2. │ ├─dplyr::select(...) 3. │ ├─tidyr::unnest(...) 4. │ ├─dplyr::mutate(...) 5. │ └─dplyr:::mutate.data.frame(...) 6. │ └─dplyr:::mutate_cols(.data, dplyr_quosures(...), by) 7. │ ├─base::withCallingHandlers(...) 8. │ └─dplyr:::mutate_col(dots[[i]], data, mask, new_columns) 9. │ └─mask$eval_all_mutate(quo) 10. │ └─dplyr (local) eval() 11. ├─purrr::map2(.data$dates, .data$tz, ~calc_all_ss(.x, tz = .y)) 12. │ └─purrr:::map2_("list", .x, .y, .f, ..., .progress = .progress) 13. │ ├─purrr:::with_indexed_errors(...) 14. │ │ └─base::withCallingHandlers(...) 15. │ ├─purrr:::call_with_cleanup(...) 16. │ └─ARUtools (local) .f(.x[[i]], .y[[i]], ...) 17. │ └─ARUtools:::calc_all_ss(.x, tz = .y) 18. │ └─ARUtools:::calc_ss(dates, tz) 19. │ ├─dplyr::as_tibble(...) 20. │ ├─dplyr::relocate(...) 21. │ ├─dplyr::rename(...) 22. │ ├─dplyr::mutate(...) 23. │ └─suncalc::getSunlightTimes(...) 24. │ ├─base::which(...) 25. │ ├─lubridate::force_tz(...) 26. │ └─lubridate:::force_tz.default(...) 27. │ └─timechange::time_force_tz(time, tz = tzone, roll_dst = roll_dst) 28. │ └─timechange:::.force_tz(time, tz, tzout, roll_dst) 29. │ ├─timechange:::from_posixct(...) 30. │ └─timechange:::C_force_tz(to_posixct(time), tz, roll_dst) 31. └─base::.handleSimpleError(...) 32. └─purrr (local) h(simpleError(msg, call)) 33. └─cli::cli_abort(...) 34. └─rlang::abort(...) Execution halted Flavor: r-devel-windows-x86_64

Version: 0.7.3
Check: tests
Result: ERROR Running 'testthat.R' [42s] Running the tests in 'tests/testthat.R' failed. Complete output: > library(testthat) > library(ARUtools) > > test_check("ARUtools") Saving _problems/test-06_calc_sun-156.R Saving _problems/test-08_selections-67.R Saving _problems/test-08_selections-101.R Extracting Dates and Times... ! Omitted 1 extra, non-json/GPS files ! Detected 2 log files [ FAIL 5 | WARN 0 | SKIP 4 | PASS 507 ] ══ Skipped tests (4) ═══════════════════════════════════════════════════════════ • On CRAN (3): 'test-08_selections.R:1:1', 'test-10_clean_logs.R:1:1', 'test-10_clean_logs.R:32:1' • SoX not available (1): 'test-07_wave_files.R:193:3' ══ Failed tests ════════════════════════════════════════════════════════════════ ── Error ('test-06_calc_sun.R:36:3'): calc_ss() ──────────────────────────────── Error in `C_force_tz(to_posixct(time), tz, roll_dst)`: CCTZ: Unrecognized output timezone: "America/Winnipeg" Backtrace: ▆ 1. ├─testthat::expect_silent(ss2 <- calc_ss(dts, tz = "America/Winnipeg")) at test-06_calc_sun.R:36:3 2. │ └─testthat:::quasi_capture(enquo(object), NULL, evaluate_promise) 3. │ ├─testthat (local) .capture(...) 4. │ │ ├─withr::with_output_sink(...) 5. │ │ │ └─base::force(code) 6. │ │ ├─base::withCallingHandlers(...) 7. │ │ └─base::withVisible(code) 8. │ └─rlang::eval_bare(quo_get_expr(.quo), quo_get_env(.quo)) 9. └─ARUtools:::calc_ss(dts, tz = "America/Winnipeg") 10. ├─dplyr::as_tibble(...) 11. ├─dplyr::relocate(...) 12. ├─dplyr::rename(...) 13. ├─dplyr::mutate(...) 14. └─suncalc::getSunlightTimes(...) 15. ├─base::which(...) 16. ├─lubridate::force_tz(...) 17. └─lubridate:::force_tz.default(...) 18. └─timechange::time_force_tz(time, tz = tzone, roll_dst = roll_dst) 19. └─timechange:::.force_tz(time, tz, tzout, roll_dst) 20. ├─timechange:::from_posixct(...) 21. └─timechange:::C_force_tz(to_posixct(time), tz, roll_dst) ── Error ('test-06_calc_sun.R:103:3'): calc_sun() ────────────────────────────── <dplyr:::mutate_error/rlang_error/error/condition> Error in `dplyr::mutate(tidyr::nest(tidyr::drop_na(dplyr::distinct(dplyr::select(m, "date", "tz", "longitude", "latitude"))), dates = -"tz"), times = purrr::map2(.data$dates, .data$tz, ~calc_all_ss(.x, tz = .y)))`: i In argument: `times = purrr::map2(.data$dates, .data$tz, ~calc_all_ss(.x, tz = .y))`. Caused by error in `purrr::map2()`: i In index: 3. Caused by error in `C_force_tz()`: ! CCTZ: Unrecognized output timezone: "America/Winnipeg" ── Error ('test-06_calc_sun.R:153:3'): calc_sun() errors etc. ────────────────── <dplyr:::mutate_error/rlang_error/error/condition> Error in `dplyr::mutate(tidyr::nest(tidyr::drop_na(dplyr::distinct(dplyr::select(m, "date", "tz", "longitude", "latitude"))), dates = -"tz"), times = purrr::map2(.data$dates, .data$tz, ~calc_all_ss(.x, tz = .y)))`: i In argument: `times = purrr::map2(.data$dates, .data$tz, ~calc_all_ss(.x, tz = .y))`. Caused by error in `purrr::map2()`: i In index: 3. Caused by error in `C_force_tz()`: ! CCTZ: Unrecognized output timezone: "America/Winnipeg" ── Error ('test-08_selections.R:65:3'): calc_selection_weights() ─────────────── <dplyr:::mutate_error/rlang_error/error/condition> Error in `dplyr::mutate(tidyr::nest(tidyr::drop_na(dplyr::distinct(dplyr::select(m, "date", "tz", "longitude", "latitude"))), dates = -"tz"), times = purrr::map2(.data$dates, .data$tz, ~calc_all_ss(.x, tz = .y)))`: i In argument: `times = purrr::map2(.data$dates, .data$tz, ~calc_all_ss(.x, tz = .y))`. Caused by error in `purrr::map2()`: i In index: 3. Caused by error in `C_force_tz()`: ! CCTZ: Unrecognized output timezone: "America/Winnipeg" ── Error ('test-08_selections.R:98:3'): sample_recordings() ──────────────────── <dplyr:::mutate_error/rlang_error/error/condition> Error in `dplyr::mutate(tidyr::nest(tidyr::drop_na(dplyr::distinct(dplyr::select(m, "date", "tz", "longitude", "latitude"))), dates = -"tz"), times = purrr::map2(.data$dates, .data$tz, ~calc_all_ss(.x, tz = .y)))`: i In argument: `times = purrr::map2(.data$dates, .data$tz, ~calc_all_ss(.x, tz = .y))`. Caused by error in `purrr::map2()`: i In index: 3. Caused by error in `C_force_tz()`: ! CCTZ: Unrecognized output timezone: "America/Winnipeg" [ FAIL 5 | WARN 0 | SKIP 4 | PASS 507 ] Error: ! Test failures. Execution halted Flavor: r-devel-windows-x86_64

Version: 0.7.3
Check: re-building of vignette outputs
Result: ERROR Error(s) in re-building vignettes: --- re-building 'ARUtools.Rmd' using rmarkdown Quitting from ARUtools.Rmd:194-197 [unnamed-chunk-14] ~~~~~~~~~~~~~~~~~~~~~~~~~~~~~~~~~~~~~~~~~~~~~~~~~~~~~~~~~~~~~~~~~~~~~~~~~~~~~~~~ <error/dplyr:::mutate_error> Error in `dplyr::mutate()`: ℹ In argument: `times = purrr::map2(.data$dates, .data$tz, ~calc_all_ss(.x, tz = .y))`. Caused by error in `purrr::map2()`: ℹ In index: 3. Caused by error in `C_force_tz()`: ! CCTZ: Unrecognized output timezone: "America/Winnipeg" --- Backtrace: ▆ 1. ├─ARUtools::calc_sun(m) 2. │ ├─dplyr::select(...) 3. │ ├─tidyr::unnest(...) 4. │ ├─dplyr::mutate(...) 5. │ └─dplyr:::mutate.data.frame(...) 6. │ └─dplyr:::mutate_cols(.data, dplyr_quosures(...), by) 7. │ ├─base::withCallingHandlers(...) 8. │ └─dplyr:::mutate_col(dots[[i]], data, mask, new_columns) 9. │ └─mask$eval_all_mutate(quo) 10. │ └─dplyr (local) eval() 11. └─purrr::map2(.data$dates, .data$tz, ~calc_all_ss(.x, tz = .y)) 12. └─purrr:::map2_("list", .x, .y, .f, ..., .progress = .progress) 13. ├─purrr:::with_indexed_errors(...) 14. │ └─base::withCallingHandlers(...) 15. ├─purrr:::call_with_cleanup(...) 16. └─ARUtools (local) .f(.x[[i]], .y[[i]], ...) 17. └─ARUtools:::calc_all_ss(.x, tz = .y) 18. └─ARUtools:::calc_ss(dates, tz) 19. ├─dplyr::as_tibble(...) 20. ├─dplyr::relocate(...) 21. ├─dplyr::rename(...) 22. ├─dplyr::mutate(...) 23. └─suncalc::getSunlightTimes(...) 24. ├─base::which(...) 25. ├─lubridate::force_tz(...) 26. └─lubridate:::force_tz.default(...) 27. └─timechange::time_force_tz(time, tz = tzone, roll_dst = roll_dst) 28. └─timechange:::.force_tz(time, tz, tzout, roll_dst) 29. ├─timechange:::from_posixct(...) 30. └─timechange:::C_force_tz(to_posixct(time), tz, roll_dst) ~~~~~~~~~~~~~~~~~~~~~~~~~~~~~~~~~~~~~~~~~~~~~~~~~~~~~~~~~~~~~~~~~~~~~~~~~~~~~~~~ Error: processing vignette 'ARUtools.Rmd' failed with diagnostics: ℹ In argument: `times = purrr::map2(.data$dates, .data$tz, ~calc_all_ss(.x, tz = .y))`. Caused by error in `purrr::map2()`: ℹ In index: 3. Caused by error in `C_force_tz()`: ! CCTZ: Unrecognized output timezone: "America/Winnipeg" --- failed re-building 'ARUtools.Rmd' --- re-building 'Misc.Rmd' using rmarkdown --- finished re-building 'Misc.Rmd' --- re-building 'SubSample.Rmd' using rmarkdown Quitting from SubSample.Rmd:87-99 [unnamed-chunk-4] ~~~~~~~~~~~~~~~~~~~~~~~~~~~~~~~~~~~~~~~~~~~~~~~~~~~~~~~~~~~~~~~~~~~~~~~~~~~~~~~~ <error/dplyr:::mutate_error> Error in `dplyr::mutate()`: ℹ In argument: `times = purrr::map2(.data$dates, .data$tz, ~calc_all_ss(.x, tz = .y))`. Caused by error in `purrr::map2()`: ℹ In index: 3. Caused by error in `C_force_tz()`: ! CCTZ: Unrecognized output timezone: "America/Winnipeg" --- Backtrace: ▆ 1. ├─dplyr::mutate(...) 2. ├─ARUtools::calc_sun(...) 3. │ ├─dplyr::select(...) 4. │ ├─tidyr::unnest(...) 5. │ ├─dplyr::mutate(...) 6. │ └─dplyr:::mutate.data.frame(...) 7. │ └─dplyr:::mutate_cols(.data, dplyr_quosures(...), by) 8. │ ├─base::withCallingHandlers(...) 9. │ └─dplyr:::mutate_col(dots[[i]], data, mask, new_columns) 10. │ └─mask$eval_all_mutate(quo) 11. │ └─dplyr (local) eval() 12. └─purrr::map2(.data$dates, .data$tz, ~calc_all_ss(.x, tz = .y)) 13. └─purrr:::map2_("list", .x, .y, .f, ..., .progress = .progress) 14. ├─purrr:::with_indexed_errors(...) 15. │ └─base::withCallingHandlers(...) 16. ├─purrr:::call_with_cleanup(...) 17. └─ARUtools (local) .f(.x[[i]], .y[[i]], ...) 18. └─ARUtools:::calc_all_ss(.x, tz = .y) 19. └─ARUtools:::calc_ss(dates, tz) 20. ├─dplyr::as_tibble(...) 21. ├─dplyr::relocate(...) 22. ├─dplyr::rename(...) 23. ├─dplyr::mutate(...) 24. └─suncalc::getSunlightTimes(...) 25. ├─base::which(...) 26. ├─lubridate::force_tz(...) 27. └─lubridate:::force_tz.default(...) 28. └─timechange::time_force_tz(time, tz = tzone, roll_dst = roll_dst) 29. └─timechange:::.force_tz(time, tz, tzout, roll_dst) 30. ├─timechange:::from_posixct(...) 31. └─timechange:::C_force_tz(to_posixct(time), tz, roll_dst) ~~~~~~~~~~~~~~~~~~~~~~~~~~~~~~~~~~~~~~~~~~~~~~~~~~~~~~~~~~~~~~~~~~~~~~~~~~~~~~~~ Error: processing vignette 'SubSample.Rmd' failed with diagnostics: ℹ In argument: `times = purrr::map2(.data$dates, .data$tz, ~calc_all_ss(.x, tz = .y))`. Caused by error in `purrr::map2()`: ℹ In index: 3. Caused by error in `C_force_tz()`: ! CCTZ: Unrecognized output timezone: "America/Winnipeg" --- failed re-building 'SubSample.Rmd' --- re-building 'customizing.Rmd' using rmarkdown --- finished re-building 'customizing.Rmd' --- re-building 'multisampling.Rmd' using rmarkdown Quitting from multisampling.Rmd:36-48 [unnamed-chunk-2] ~~~~~~~~~~~~~~~~~~~~~~~~~~~~~~~~~~~~~~~~~~~~~~~~~~~~~~~~~~~~~~~~~~~~~~~~~~~~~~~~ <error/dplyr:::mutate_error> Error in `dplyr::mutate()`: ℹ In argument: `times = purrr::map2(.data$dates, .data$tz, ~calc_all_ss(.x, tz = .y))`. Caused by error in `purrr::map2()`: ℹ In index: 3. Caused by error in `C_force_tz()`: ! CCTZ: Unrecognized output timezone: "America/Winnipeg" --- Backtrace: ▆ 1. ├─dplyr::mutate(...) 2. ├─ARUtools::calc_sun(...) 3. │ ├─dplyr::select(...) 4. │ ├─tidyr::unnest(...) 5. │ ├─dplyr::mutate(...) 6. │ └─dplyr:::mutate.data.frame(...) 7. │ └─dplyr:::mutate_cols(.data, dplyr_quosures(...), by) 8. │ ├─base::withCallingHandlers(...) 9. │ └─dplyr:::mutate_col(dots[[i]], data, mask, new_columns) 10. │ └─mask$eval_all_mutate(quo) 11. │ └─dplyr (local) eval() 12. └─purrr::map2(.data$dates, .data$tz, ~calc_all_ss(.x, tz = .y)) 13. └─purrr:::map2_("list", .x, .y, .f, ..., .progress = .progress) 14. ├─purrr:::with_indexed_errors(...) 15. │ └─base::withCallingHandlers(...) 16. ├─purrr:::call_with_cleanup(...) 17. └─ARUtools (local) .f(.x[[i]], .y[[i]], ...) 18. └─ARUtools:::calc_all_ss(.x, tz = .y) 19. └─ARUtools:::calc_ss(dates, tz) 20. ├─dplyr::as_tibble(...) 21. ├─dplyr::relocate(...) 22. ├─dplyr::rename(...) 23. ├─dplyr::mutate(...) 24. └─suncalc::getSunlightTimes(...) 25. ├─base::which(...) 26. ├─lubridate::force_tz(...) 27. └─lubridate:::force_tz.default(...) 28. └─timechange::time_force_tz(time, tz = tzone, roll_dst = roll_dst) 29. └─timechange:::.force_tz(time, tz, tzout, roll_dst) 30. ├─timechange:::from_posixct(...) 31. └─timechange:::C_force_tz(to_posixct(time), tz, roll_dst) ~~~~~~~~~~~~~~~~~~~~~~~~~~~~~~~~~~~~~~~~~~~~~~~~~~~~~~~~~~~~~~~~~~~~~~~~~~~~~~~~ Error: processing vignette 'multisampling.Rmd' failed with diagnostics: ℹ In argument: `times = purrr::map2(.data$dates, .data$tz, ~calc_all_ss(.x, tz = .y))`. Caused by error in `purrr::map2()`: ℹ In index: 3. Caused by error in `C_force_tz()`: ! CCTZ: Unrecognized output timezone: "America/Winnipeg" --- failed re-building 'multisampling.Rmd' --- re-building 'spatial.Rmd' using rmarkdown Quitting from spatial.Rmd:68-71 [unnamed-chunk-6] ~~~~~~~~~~~~~~~~~~~~~~~~~~~~~~~~~~~~~~~~~~~~~~~~~~~~~~~~~~~~~~~~~~~~~~~~~~~~~~~~ <error/dplyr:::mutate_error> Error in `dplyr::mutate()`: ℹ In argument: `times = purrr::map2(.data$dates, .data$tz, ~calc_all_ss(.x, tz = .y))`. Caused by error in `purrr::map2()`: ℹ In index: 3. Caused by error in `C_force_tz()`: ! CCTZ: Unrecognized output timezone: "America/Winnipeg" --- Backtrace: ▆ 1. ├─ARUtools::calc_sun(m) 2. │ ├─dplyr::select(...) 3. │ ├─tidyr::unnest(...) 4. │ ├─dplyr::mutate(...) 5. │ └─dplyr:::mutate.data.frame(...) 6. │ └─dplyr:::mutate_cols(.data, dplyr_quosures(...), by) 7. │ ├─base::withCallingHandlers(...) 8. │ └─dplyr:::mutate_col(dots[[i]], data, mask, new_columns) 9. │ └─mask$eval_all_mutate(quo) 10. │ └─dplyr (local) eval() 11. └─purrr::map2(.data$dates, .data$tz, ~calc_all_ss(.x, tz = .y)) 12. └─purrr:::map2_("list", .x, .y, .f, ..., .progress = .progress) 13. ├─purrr:::with_indexed_errors(...) 14. │ └─base::withCallingHandlers(...) 15. ├─purrr:::call_with_cleanup(...) 16. └─ARUtools (local) .f(.x[[i]], .y[[i]], ...) 17. └─ARUtools:::calc_all_ss(.x, tz = .y) 18. └─ARUtools:::calc_ss(dates, tz) 19. ├─dplyr::as_tibble(...) 20. ├─dplyr::relocate(...) 21. ├─dplyr::rename(...) 22. ├─dplyr::mutate(...) 23. └─suncalc::getSunlightTimes(...) 24. ├─base::which(...) 25. ├─lubridate::force_tz(...) 26. └─lubridate:::force_tz.default(...) 27. └─timechange::time_force_tz(time, tz = tzone, roll_dst = roll_dst) 28. └─timechange:::.force_tz(time, tz, tzout, roll_dst) 29. ├─timechange:::from_posixct(...) 30. └─timechange:::C_force_tz(to_posixct(time), tz, roll_dst) ~~~~~~~~~~~~~~~~~~~~~~~~~~~~~~~~~~~~~~~~~~~~~~~~~~~~~~~~~~~~~~~~~~~~~~~~~~~~~~~~ Error: processing vignette 'spatial.Rmd' failed with diagnostics: ℹ In argument: `times = purrr::map2(.data$dates, .data$tz, ~calc_all_ss(.x, tz = .y))`. Caused by error in `purrr::map2()`: ℹ In index: 3. Caused by error in `C_force_tz()`: ! CCTZ: Unrecognized output timezone: "America/Winnipeg" --- failed re-building 'spatial.Rmd' --- re-building 'timezones.Rmd' using rmarkdown Quitting from timezones.Rmd:108-110 [unnamed-chunk-6] ~~~~~~~~~~~~~~~~~~~~~~~~~~~~~~~~~~~~~~~~~~~~~~~~~~~~~~~~~~~~~~~~~~~~~~~~~~~~~~~~ <error/dplyr:::mutate_error> Error in `dplyr::mutate()`: ℹ In argument: `times = purrr::map2(.data$dates, .data$tz, ~calc_all_ss(.x, tz = .y))`. Caused by error in `purrr::map2()`: ℹ In index: 3. Caused by error in `C_force_tz()`: ! CCTZ: Unrecognized output timezone: "America/Winnipeg" --- Backtrace: ▆ 1. ├─ARUtools::calc_sun(m, aru_tz = "local") 2. │ ├─dplyr::select(...) 3. │ ├─tidyr::unnest(...) 4. │ ├─dplyr::mutate(...) 5. │ └─dplyr:::mutate.data.frame(...) 6. │ └─dplyr:::mutate_cols(.data, dplyr_quosures(...), by) 7. │ ├─base::withCallingHandlers(...) 8. │ └─dplyr:::mutate_col(dots[[i]], data, mask, new_columns) 9. │ └─mask$eval_all_mutate(quo) 10. │ └─dplyr (local) eval() 11. └─purrr::map2(.data$dates, .data$tz, ~calc_all_ss(.x, tz = .y)) 12. └─purrr:::map2_("list", .x, .y, .f, ..., .progress = .progress) 13. ├─purrr:::with_indexed_errors(...) 14. │ └─base::withCallingHandlers(...) 15. ├─purrr:::call_with_cleanup(...) 16. └─ARUtools (local) .f(.x[[i]], .y[[i]], ...) 17. └─ARUtools:::calc_all_ss(.x, tz = .y) 18. └─ARUtools:::calc_ss(dates, tz) 19. ├─dplyr::as_tibble(...) 20. ├─dplyr::relocate(...) 21. ├─dplyr::rename(...) 22. ├─dplyr::mutate(...) 23. └─suncalc::getSunlightTimes(...) 24. ├─base::which(...) 25. ├─lubridate::force_tz(...) 26. └─lubridate:::force_tz.default(...) 27. └─timechange::time_force_tz(time, tz = tzone, roll_dst = roll_dst) 28. └─timechange:::.force_tz(time, tz, tzout, roll_dst) 29. ├─timechange:::from_posixct(...) 30. └─timechange:::C_force_tz(to_posixct(time), tz, roll_dst) ~~~~~~~~~~~~~~~~~~~~~~~~~~~~~~~~~~~~~~~~~~~~~~~~~~~~~~~~~~~~~~~~~~~~~~~~~~~~~~~~ Error: processing vignette 'timezones.Rmd' failed with diagnostics: ℹ In argument: `times = purrr::map2(.data$dates, .data$tz, ~calc_all_ss(.x, tz = .y))`. Caused by error in `purrr::map2()`: ℹ In index: 3. Caused by error in `C_force_tz()`: ! CCTZ: Unrecognized output timezone: "America/Winnipeg" --- failed re-building 'timezones.Rmd' SUMMARY: processing the following files failed: 'ARUtools.Rmd' 'SubSample.Rmd' 'multisampling.Rmd' 'spatial.Rmd' 'timezones.Rmd' Error: Vignette re-building failed. Execution halted Flavor: r-devel-windows-x86_64